Willkommen Gast. Bitte einloggen oder registrieren. Haben Sie Ihre Aktivierungs E-Mail übersehen?
19.09.2019, 11:10:24

.
Einloggen mit Benutzername, Passwort und Sitzungslänge

Mitglieder
  • Mitglieder insgesamt: 22558
  • Letzte: Weber-J
Statistiken
  • Beiträge insgesamt: 608559
  • Themen insgesamt: 49264
  • Heute online: 595
  • Am meisten online: 992
  • (17.11.2018, 20:17:55)
Benutzer Online

Autor Thema: [gelöst]  NVIDIA 6600GT Treiber wird nicht geladen  (Gelesen 488 mal)

0 Mitglieder und 1 Gast betrachten dieses Thema.

[gelöst] NVIDIA 6600GT Treiber wird nicht geladen
« am: 10.09.2019, 22:43:28 »
LinuxMint 18.3 MATE 32bit

hans@hans-D856GLC ~/Schreibtisch $ inxi -Fzr
System:    Host: hans-D856GLC Kernel: 4.15.0-60-generic i686 (32 bit) Desktop: MATE 1.18.0
           Distro: Linux Mint 18.3 Sylvia
Machine:   Mobo: Intel model: D865GLC v: AAC28903-402
           Bios: Intel v: BF86510A.86A.0077.P25.0508040031 date: 08/04/2005
CPU:       Single core Intel Pentium 4 (-UP-) cache: 512 KB speed: 2394 MHz (max)
Graphics:  Card: NVIDIA NV43 [GeForce 6600 GT]
           Display Server: X.Org 1.18.4 drivers: vesa (unloaded: fbdev) FAILED: nvidia,nouveau
           Resolution: 1024x768@0.00hz
           GLX Renderer: N/A GLX Version: N/A
Audio:     Card Intel 82801EB/ER (ICH5/ICH5R) AC'97 Audio Controller driver: snd_intel8x0
           Sound: Advanced Linux Sound Architecture v: k4.15.0-60-generic
Network:   Card-1: 3Com 3c905C-TX/TX-M [Tornado] driver: 3c59x
           IF: enp2s1 state: down mac: <filter>
           Card-2: NetGear WNA1100 Wireless-N 150 [Atheros AR9271] driver: ath9k_htc
           IF: wlxe0469a168be1 state: N/A mac: N/A
Drives:    HDD Total Size: 80.0GB (14.3% used) ID-1: /dev/sda model: ST380011A size: 80.0GB
Partition: ID-1: / size: 30G used: 6.8G (25%) fs: ext4 dev: /dev/sda1
           ID-2: /home size: 40G used: 135M (1%) fs: ext4 dev: /dev/sda3
           ID-3: swap-1 size: 4.29GB used: 0.00GB (0%) fs: swap dev: /dev/sda2
RAID:      No RAID devices: /proc/mdstat, md_mod kernel module present
Sensors:   None detected - is lm-sensors installed and configured?
Repos:     Active apt sources in file: /etc/apt/sources.list.d/official-package-repositories.list
           deb http://mirror.inode.at/linuxmint/packages sylvia main upstream import backport
           deb http://ubuntu.lagis.at/ubuntu xenial main restricted universe multiverse
           deb http://ubuntu.lagis.at/ubuntu xenial-updates main restricted universe multiverse
           deb http://ubuntu.lagis.at/ubuntu xenial-backports main restricted universe multiverse
           deb http://security.ubuntu.com/ubuntu/ xenial-security main restricted universe multiverse
           deb http://archive.canonical.com/ubuntu/ xenial partner
Info:      Processes: 137 Uptime: 20 min Memory: 1083.2/1947.1MB Client: Shell (bash) inxi: 2.2.35
hans@hans-D856GLC ~/Schreibtisch $

Guten Abend,

Ich habe dieses LinuxMint neu installiert, damit diese alte Grafikkarte unterstützt wird.

Weil es mit USBstick und Live-Systemen mit diesem Rechner nicht möglich war zu booten,
habe ich das Linux auf einem neueren 64bit Rechner auf diese Festplatte gebracht.

Dann diese Platte in den alten Rechner gesteckt. Updates gemacht. Mit Treiberverwaltung den Nvidia-304
nachgeladen. Aber es gibt ein Problem mit Nvidia und dem Kernel.
Der neue Nvidia Treiber wird nicht geladen.

ich rufe diese Prozedur auf:

hans@hans-D2461-C1 ~/Schreibtisch $ sudo dpkg-reconfigure  nvidia-304
[sudo] Passwort für hans:
Removing all DKMS Modules
Done.
update-initramfs: deferring update (trigger activated)
INFO:Enable nvidia-304
DEBUG:Parsing /usr/share/ubuntu-drivers-common/quirks/dell_latitude
DEBUG:Parsing /usr/share/ubuntu-drivers-common/quirks/put_your_quirks_here
DEBUG:Parsing /usr/share/ubuntu-drivers-common/quirks/lenovo_thinkpad
Loading new nvidia-304-304.135 DKMS files...
Building only for 4.15.0-60-generic
Building for architecture i686
Building initial module for 4.15.0-60-generic
ERROR (dkms apport): kernel package linux-headers-4.15.0-60-generic is not supported
Error! Bad return status for module build on kernel: 4.15.0-60-generic (i686)
Consult /var/lib/dkms/nvidia-304/304.135/build/make.log for more information.
Trigger für initramfs-tools (0.122ubuntu8.14) werden verarbeitet ...
update-initramfs: Generating /boot/initrd.img-4.15.0-60-generic
Warning: No support for locale: de_AT.utf8
hans@hans-D2461-C1 ~/Schreibtisch $
dann kommen diese Fehlermeldungen im make.log

DKMS make.log for nvidia-304-304.135 for kernel 4.15.0-60-generic (i686)
Mit Sep 11 00:11:34 CEST 2019
NVIDIA: calling KBUILD...
test -e include/generated/autoconf.h -a -e include/config/auto.conf || ( \
echo >&2; \
echo >&2 "  ERROR: Kernel configuration is invalid."; \
echo >&2 "         include/generated/autoconf.h or include/config/auto.conf are missing.";\
echo >&2 "         Run 'make oldconfig && make prepare' on kernel src to fix it."; \
echo >&2 ; \
/bin/false)
mkdir -p /var/lib/dkms/nvidia-304/304.135/build/.tmp_versions ; rm -f /var/lib/dkms/nvidia-304/304.135/build/.tmp_versions/*
make -f ./scripts/Makefile.build obj=/var/lib/dkms/nvidia-304/304.135/build
  cc -Wp,-MD,/var/lib/dkms/nvidia-304/304.135/build/.nv.o.d  -nostdinc -isystem /usr/lib/gcc/i686-linux-gnu/5/include  -I./arch/x86/include -I./arch/x86/include/generated  -I./include -I./arch/x86/include/uapi -I./arch/x86/include/generated/uapi -I./include/uapi -I./include/generated/uapi -include ./include/linux/kconfig.h -Iubuntu/include  -D__KERNEL__ -Wall -Wundef -Wstrict-prototypes -Wno-trigraphs -fno-strict-aliasing -fno-common -fshort-wchar -Werror-implicit-function-declaration -Wno-format-security -std=gnu89 -fno-PIE -mno-sse -mno-mmx -mno-sse2 -mno-3dnow -mno-avx -m32 -msoft-float -mregparm=3 -freg-struct-return -fno-pic -mpreferred-stack-boundary=2 -march=i686 -mtune=generic -Wa,-mtune=generic32 -ffreestanding -DCONFIG_AS_CFI=1 -DCONFIG_AS_CFI_SIGNAL_FRAME=1 -DCONFIG_AS_CFI_SECTIONS=1 -DCONFIG_AS_SSSE3=1 -DCONFIG_AS_CRC32=1 -DCONFIG_AS_AVX=1 -DCONFIG_AS_AVX2=1 -DCONFIG_AS_AVX512=1 -DCONFIG_AS_SHA1_NI=1 -DCONFIG_AS_SHA256_NI=1 -pipe -Wno-sign-compare -fno-asynchronous-unwind-tables -mindirect-branch=thunk-extern -mindirect-branch-register -fno-jump-tables -fno-delete-null-pointer-checks -O2 --param=allow-store-data-races=0 -DCC_HAVE_ASM_GOTO -Wframe-larger-than=1024 -fstack-protector-strong -Wno-unused-but-set-variable -fno-omit-frame-pointer -fno-optimize-sibling-calls -fno-var-tracking-assignments -pg -mfentry -DCC_USING_FENTRY -Wdeclaration-after-statement -Wno-pointer-sign -fno-strict-overflow -fno-merge-all-constants -fmerge-constants -fno-stack-check -fconserve-stack -Werror=implicit-int -Werror=strict-prototypes -Werror=date-time -Werror=incompatible-pointer-types -Werror=designated-init -I/var/lib/dkms/nvidia-304/304.135/build -Wall -MD -Wsign-compare -Wno-cast-qual -Wno-error -D__KERNEL__ -DMODULE -DNVRM -DNV_VERSION_STRING=\"304.135\" -Wno-unused-function -Wuninitialized -UDEBUG -U_DEBUG -DNDEBUG  -DMODULE  -DKBUILD_BASENAME='"nv"'  -DKBUILD_MODNAME='"nvidia"' -c -o /var/lib/dkms/nvidia-304/304.135/build/nv.o /var/lib/dkms/nvidia-304/304.135/build/nv.c
In file included from ./include/linux/byteorder/little_endian.h:11:0,
                 from ./arch/x86/include/uapi/asm/byteorder.h:5,
                 from ./include/asm-generic/bitops/le.h:6,
                 from ./arch/x86/include/asm/bitops.h:512,
                 from ./include/linux/bitops.h:18,
                 from ./include/linux/kernel.h:11,
                 from ./arch/x86/include/asm/percpu.h:45,
                 from ./arch/x86/include/asm/current.h:6,
                 from ./include/linux/sched.h:12,
                 from ./include/linux/utsname.h:6,
                 from /var/lib/dkms/nvidia-304/304.135/build/nv-linux.h:40,
                 from /var/lib/dkms/nvidia-304/304.135/build/nv.c:13:
./include/linux/byteorder/generic.h: In function ‘cpu_to_be32_array’:
./include/linux/byteorder/generic.h:178:16: warning: comparison between signed and unsigned integer expressions [-Wsign-compare]
  for (i = 0; i < len; i++)
                ^
./include/linux/byteorder/generic.h: In function ‘be32_to_cpu_array’:
./include/linux/byteorder/generic.h:186:16: warning: comparison between signed and unsigned integer expressions [-Wsign-compare]
  for (i = 0; i < len; i++)
                ^
In file included from ./arch/x86/include/asm/current.h:5:0,
                 from ./include/linux/sched.h:12,
                 from ./include/linux/utsname.h:6,
                 from /var/lib/dkms/nvidia-304/304.135/build/nv-linux.h:40,
                 from /var/lib/dkms/nvidia-304/304.135/build/nv.c:13:
./include/linux/thread_info.h: In function ‘check_copy_size’:
./include/linux/thread_info.h:130:29: warning: comparison between signed and unsigned integer expressions [-Wsign-compare]
  if (unlikely(sz >= 0 && sz < bytes)) {
                             ^
./include/linux/compiler.h:77:42: note: in definition of macro ‘unlikely’
 # define unlikely(x) __builtin_expect(!!(x), 0)
                                          ^
./include/asm-generic/qrwlock.h: In function ‘queued_write_trylock’:
./include/asm-generic/qrwlock.h:75:36: warning: comparison between signed and unsigned integer expressions [-Wsign-compare]
           cnts, cnts | _QW_LOCKED) == cnts);
                                    ^
./include/linux/compiler.h:76:40: note: in definition of macro ‘likely’
 # define likely(x) __builtin_expect(!!(x), 1)
                                        ^
In file included from ./include/linux/ipc.h:7:0,
                 from ./include/uapi/linux/sem.h:5,
                 from ./include/linux/sem.h:9,
                 from ./include/linux/sched.h:15,
                 from ./include/linux/utsname.h:6,
                 from /var/lib/dkms/nvidia-304/304.135/build/nv-linux.h:40,
                 from /var/lib/dkms/nvidia-304/304.135/build/nv.c:13:
./include/linux/rhashtable.h: In function ‘rht_grow_above_75’:
./include/linux/rhashtable.h:295:34: warning: comparison between signed and unsigned integer expressions [-Wsign-compare]
  return atomic_read(&ht->nelems) > (tbl->size / 4 * 3) &&
                                  ^
./include/linux/rhashtable.h: In function ‘rht_shrink_below_30’:
./include/linux/rhashtable.h:308:34: warning: comparison between signed and unsigned integer expressions [-Wsign-compare]
  return atomic_read(&ht->nelems) < (tbl->size * 3 / 10) &&
                                  ^
./include/linux/rhashtable.h: In function ‘rht_grow_above_100’:
./include/linux/rhashtable.h:320:34: warning: comparison between signed and unsigned integer expressions [-Wsign-compare]
  return atomic_read(&ht->nelems) > tbl->size &&
                                  ^
./include/linux/rhashtable.h: In function ‘rht_grow_above_max’:
./include/linux/rhashtable.h:332:34: warning: comparison between signed and unsigned integer expressions [-Wsign-compare]
  return atomic_read(&ht->nelems) >= ht->max_elems;
                                  ^
In file included from ./arch/x86/include/asm/current.h:5:0,
                 from ./include/linux/sched.h:12,
                 from ./include/linux/utsname.h:6,
                 from /var/lib/dkms/nvidia-304/304.135/build/nv-linux.h:40,
                 from /var/lib/dkms/nvidia-304/304.135/build/nv.c:13:
./include/linux/mmzone.h: In function ‘next_zones_zonelist’:
./include/linux/mmzone.h:989:44: warning: comparison between signed and unsigned integer expressions [-Wsign-compare]
  if (likely(!nodes && zonelist_zone_idx(z) <= highest_zoneidx))
                                            ^
./include/linux/compiler.h:76:40: note: in definition of macro ‘likely’
 # define likely(x) __builtin_expect(!!(x), 1)
                                        ^
In file included from ./arch/x86/include/asm/current.h:6:0,
                 from ./include/linux/sched.h:12,
                 from ./include/linux/utsname.h:6,
                 from /var/lib/dkms/nvidia-304/304.135/build/nv-linux.h:40,
                 from /var/lib/dkms/nvidia-304/304.135/build/nv.c:13:
./include/linux/percpu-refcount.h: In function ‘percpu_ref_get_many’:
./arch/x86/include/asm/percpu.h:131:31: warning: comparison between signed and unsigned integer expressions [-Wsign-compare]
          ((val) == 1 || (val) == -1)) ?  \
                               ^
./arch/x86/include/asm/percpu.h:420:34: note: in expansion of macro ‘percpu_add_op’
 #define this_cpu_add_1(pcp, val) percpu_add_op((pcp), val)
                                  ^
./include/linux/percpu-defs.h:379:11: note: in expansion of macro ‘this_cpu_add_1’
   case 1: stem##1(variable, __VA_ARGS__);break;  \
           ^
./include/linux/percpu-defs.h:511:33: note: in expansion of macro ‘__pcpu_size_call’
 #define this_cpu_add(pcp, val)  __pcpu_size_call(this_cpu_add_, pcp, val)
                                 ^
./include/linux/percpu-refcount.h:177:3: note: in expansion of macro ‘this_cpu_add’
   this_cpu_add(*percpu_count, nr);
   ^
./arch/x86/include/asm/percpu.h:131:31: warning: comparison between signed and unsigned integer expressions [-Wsign-compare]
          ((val) == 1 || (val) == -1)) ?  \
                               ^
./arch/x86/include/asm/percpu.h:421:34: note: in expansion of macro ‘percpu_add_op’
 #define this_cpu_add_2(pcp, val) percpu_add_op((pcp), val)
                                  ^
./include/linux/percpu-defs.h:380:11: note: in expansion of macro ‘this_cpu_add_2’
   case 2: stem##2(variable, __VA_ARGS__);break;  \
           ^
./include/linux/percpu-defs.h:511:33: note: in expansion of macro ‘__pcpu_size_call’
 #define this_cpu_add(pcp, val)  __pcpu_size_call(this_cpu_add_, pcp, val)
                                 ^
./include/linux/percpu-refcount.h:177:3: note: in expansion of macro ‘this_cpu_add’
   this_cpu_add(*percpu_count, nr);
   ^
./arch/x86/include/asm/percpu.h:131:31: warning: comparison between signed and unsigned integer expressions [-Wsign-compare]
          ((val) == 1 || (val) == -1)) ?  \
                               ^
./arch/x86/include/asm/percpu.h:422:34: note: in expansion of macro ‘percpu_add_op’
 #define this_cpu_add_4(pcp, val) percpu_add_op((pcp), val)
                                  ^
./include/linux/percpu-defs.h:381:11: note: in expansion of macro ‘this_cpu_add_4’
   case 4: stem##4(variable, __VA_ARGS__);break;  \
           ^
./include/linux/percpu-defs.h:511:33: note: in expansion of macro ‘__pcpu_size_call’
 #define this_cpu_add(pcp, val)  __pcpu_size_call(this_cpu_add_, pcp, val)
                                 ^
./include/linux/percpu-refcount.h:177:3: note: in expansion of macro ‘this_cpu_add’
   this_cpu_add(*percpu_count, nr);
   ^
./include/linux/percpu-refcount.h: In function ‘percpu_ref_put_many’:
./arch/x86/include/asm/percpu.h:131:31: warning: comparison between signed and unsigned integer expressions [-Wsign-compare]
          ((val) == 1 || (val) == -1)) ?  \
                               ^
./arch/x86/include/asm/percpu.h:420:34: note: in expansion of macro ‘percpu_add_op’
 #define this_cpu_add_1(pcp, val) percpu_add_op((pcp), val)
                                  ^
./include/linux/percpu-defs.h:379:11: note: in expansion of macro ‘this_cpu_add_1’
   case 1: stem##1(variable, __VA_ARGS__);break;  \
           ^
./include/linux/percpu-defs.h:511:33: note: in expansion of macro ‘__pcpu_size_call’
 #define this_cpu_add(pcp, val)  __pcpu_size_call(this_cpu_add_, pcp, val)
                                 ^
./include/linux/percpu-defs.h:521:33: note: in expansion of macro ‘this_cpu_add’
 #define this_cpu_sub(pcp, val)  this_cpu_add(pcp, -(typeof(pcp))(val))
                                 ^
./include/linux/percpu-refcount.h:276:3: note: in expansion of macro ‘this_cpu_sub’
   this_cpu_sub(*percpu_count, nr);
   ^
./arch/x86/include/asm/percpu.h:131:31: warning: comparison between signed and unsigned integer expressions [-Wsign-compare]
          ((val) == 1 || (val) == -1)) ?  \
                               ^
./arch/x86/include/asm/percpu.h:421:34: note: in expansion of macro ‘percpu_add_op’
 #define this_cpu_add_2(pcp, val) percpu_add_op((pcp), val)
                                  ^
./include/linux/percpu-defs.h:380:11: note: in expansion of macro ‘this_cpu_add_2’
   case 2: stem##2(variable, __VA_ARGS__);break;  \
           ^
./include/linux/percpu-defs.h:511:33: note: in expansion of macro ‘__pcpu_size_call’
 #define this_cpu_add(pcp, val)  __pcpu_size_call(this_cpu_add_, pcp, val)
                                 ^
./include/linux/percpu-defs.h:521:33: note: in expansion of macro ‘this_cpu_add’
 #define this_cpu_sub(pcp, val)  this_cpu_add(pcp, -(typeof(pcp))(val))
                                 ^
./include/linux/percpu-refcount.h:276:3: note: in expansion of macro ‘this_cpu_sub’
   this_cpu_sub(*percpu_count, nr);
   ^
./arch/x86/include/asm/percpu.h:131:31: warning: comparison between signed and unsigned integer expressions [-Wsign-compare]
          ((val) == 1 || (val) == -1)) ?  \
                               ^
./arch/x86/include/asm/percpu.h:422:34: note: in expansion of macro ‘percpu_add_op’
 #define this_cpu_add_4(pcp, val) percpu_add_op((pcp), val)
                                  ^
./include/linux/percpu-defs.h:381:11: note: in expansion of macro ‘this_cpu_add_4’
   case 4: stem##4(variable, __VA_ARGS__);break;  \
           ^
./include/linux/percpu-defs.h:511:33: note: in expansion of macro ‘__pcpu_size_call’
 #define this_cpu_add(pcp, val)  __pcpu_size_call(this_cpu_add_, pcp, val)
                                 ^
./include/linux/percpu-defs.h:521:33: note: in expansion of macro ‘this_cpu_add’
 #define this_cpu_sub(pcp, val)  this_cpu_add(pcp, -(typeof(pcp))(val))
                                 ^
./include/linux/percpu-refcount.h:276:3: note: in expansion of macro ‘this_cpu_sub’
   this_cpu_sub(*percpu_count, nr);
   ^
./include/linux/percpu-rwsem.h: In function ‘percpu_up_read_preempt_enable’:
./arch/x86/include/asm/percpu.h:131:31: warning: comparison between signed and unsigned integer expressions [-Wsign-compare]
          ((val) == 1 || (val) == -1)) ?  \
                               ^
./arch/x86/include/asm/percpu.h:401:34: note: in expansion of macro ‘percpu_add_op’
 #define raw_cpu_add_1(pcp, val)  percpu_add_op((pcp), val)
                                  ^
./include/linux/percpu-defs.h:379:11: note: in expansion of macro ‘raw_cpu_add_1’
   case 1: stem##1(variable, __VA_ARGS__);break;  \
           ^
./include/linux/percpu-defs.h:424:32: note: in expansion of macro ‘__pcpu_size_call’
 #define raw_cpu_add(pcp, val)  __pcpu_size_call(raw_cpu_add_, pcp, val)
                                ^
./include/linux/percpu-defs.h:460:2: note: in expansion of macro ‘raw_cpu_add’
  raw_cpu_add(pcp, val);      \
  ^
./include/linux/percpu-defs.h:498:34: note: in expansion of macro ‘__this_cpu_add’
 #define __this_cpu_sub(pcp, val) __this_cpu_add(pcp, -(typeof(pcp))(val))
                                  ^
./include/linux/percpu-defs.h:500:30: note: in expansion of macro ‘__this_cpu_sub’
 #define __this_cpu_dec(pcp)  __this_cpu_sub(pcp, 1)
                              ^
./include/linux/percpu-rwsem.h:97:3: note: in expansion of macro ‘__this_cpu_dec’
   __this_cpu_dec(*sem->read_count);
   ^
./arch/x86/include/asm/percpu.h:131:31: warning: comparison between signed and unsigned integer expressions [-Wsign-compare]
          ((val) == 1 || (val) == -1)) ?  \
                               ^
./arch/x86/include/asm/percpu.h:402:34: note: in expansion of macro ‘percpu_add_op’
 #define raw_cpu_add_2(pcp, val)  percpu_add_op((pcp), val)
                                  ^
./include/linux/percpu-defs.h:380:11: note: in expansion of macro ‘raw_cpu_add_2’
   case 2: stem##2(variable, __VA_ARGS__);break;  \
           ^
./include/linux/percpu-defs.h:424:32: note: in expansion of macro ‘__pcpu_size_call’
 #define raw_cpu_add(pcp, val)  __pcpu_size_call(raw_cpu_add_, pcp, val)
                                ^
./include/linux/percpu-defs.h:460:2: note: in expansion of macro ‘raw_cpu_add’
  raw_cpu_add(pcp, val);      \
  ^
./include/linux/percpu-defs.h:498:34: note: in expansion of macro ‘__this_cpu_add’
 #define __this_cpu_sub(pcp, val) __this_cpu_add(pcp, -(typeof(pcp))(val))
                                  ^
./include/linux/percpu-defs.h:500:30: note: in expansion of macro ‘__this_cpu_sub’
 #define __this_cpu_dec(pcp)  __this_cpu_sub(pcp, 1)
                              ^
./include/linux/percpu-rwsem.h:97:3: note: in expansion of macro ‘__this_cpu_dec’
   __this_cpu_dec(*sem->read_count);
   ^
./arch/x86/include/asm/percpu.h:131:31: warning: comparison between signed and unsigned integer expressions [-Wsign-compare]
          ((val) == 1 || (val) == -1)) ?  \
                               ^
./arch/x86/include/asm/percpu.h:403:34: note: in expansion of macro ‘percpu_add_op’
 #define raw_cpu_add_4(pcp, val)  percpu_add_op((pcp), val)
                                  ^
./include/linux/percpu-defs.h:381:11: note: in expansion of macro ‘raw_cpu_add_4’
   case 4: stem##4(variable, __VA_ARGS__);break;  \
           ^
./include/linux/percpu-defs.h:424:32: note: in expansion of macro ‘__pcpu_size_call’
 #define raw_cpu_add(pcp, val)  __pcpu_size_call(raw_cpu_add_, pcp, val)
                                ^
./include/linux/percpu-defs.h:460:2: note: in expansion of macro ‘raw_cpu_add’
  raw_cpu_add(pcp, val);      \
  ^
./include/linux/percpu-defs.h:498:34: note: in expansion of macro ‘__this_cpu_add’
 #define __this_cpu_sub(pcp, val) __this_cpu_add(pcp, -(typeof(pcp))(val))
                                  ^
./include/linux/percpu-defs.h:500:30: note: in expansion of macro ‘__this_cpu_sub’
 #define __this_cpu_dec(pcp)  __this_cpu_sub(pcp, 1)
                              ^
./include/linux/percpu-rwsem.h:97:3: note: in expansion of macro ‘__this_cpu_dec’
   __this_cpu_dec(*sem->read_count);
   ^
In file included from ./arch/x86/include/asm/paravirt.h:17:0,
                 from ./arch/x86/include/asm/irqflags.h:72,
                 from ./include/linux/irqflags.h:16,
                 from ./include/linux/rcupdate.h:39,
                 from ./include/linux/rculist.h:11,
                 from ./include/linux/pid.h:5,
                 from ./include/linux/sched.h:14,
                 from ./include/linux/utsname.h:6,
                 from /var/lib/dkms/nvidia-304/304.135/build/nv-linux.h:40,
                 from /var/lib/dkms/nvidia-304/304.135/build/nv.c:13:
./include/linux/vmstat.h: In function ‘zone_page_state_snapshot’:
./include/linux/cpumask.h:231:9: warning: comparison between signed and unsigned integer expressions [-Wsign-compare]
   (cpu) < nr_cpu_ids;)
         ^
./include/linux/cpumask.h:766:36: note: in expansion of macro ‘for_each_cpu’
 #define for_each_online_cpu(cpu)   for_each_cpu((cpu), cpu_online_mask)
                                    ^
./include/linux/vmstat.h:210:2: note: in expansion of macro ‘for_each_online_cpu’
  for_each_online_cpu(cpu)
  ^
./include/linux/vmstat.h: In function ‘node_page_state_snapshot’:
./include/linux/cpumask.h:231:9: warning: comparison between signed and unsigned integer expressions [-Wsign-compare]
   (cpu) < nr_cpu_ids;)
         ^
./include/linux/cpumask.h:766:36: note: in expansion of macro ‘for_each_cpu’
 #define for_each_online_cpu(cpu)   for_each_cpu((cpu), cpu_online_mask)
                                    ^
./include/linux/vmstat.h:226:2: note: in expansion of macro ‘for_each_online_cpu’
  for_each_online_cpu(cpu)
  ^
In file included from ./include/linux/efi.h:20:0,
                 from /var/lib/dkms/nvidia-304/304.135/build/nv-linux.h:176,
                 from /var/lib/dkms/nvidia-304/304.135/build/nv.c:13:
./include/linux/rtc.h: In function ‘rtc_tv_nsec_ok’:
./include/linux/rtc.h:253:22: warning: comparison between signed and unsigned integer expressions [-Wsign-compare]
  if (to_set->tv_nsec < TIME_SET_NSEC_FUZZ) {
                      ^
./include/linux/rtc.h:258:22: warning: comparison between signed and unsigned integer expressions [-Wsign-compare]
  if (to_set->tv_nsec > NSEC_PER_SEC - TIME_SET_NSEC_FUZZ) {
                      ^
/var/lib/dkms/nvidia-304/304.135/build/nv.c: In function ‘nv_start_rc_timer’:
/var/lib/dkms/nvidia-304/304.135/build/nv.c:3033:5: error: implicit declaration of function ‘init_timer’ [-Werror=implicit-function-declaration]
     init_timer(&nvl->rc_timer);
     ^
/var/lib/dkms/nvidia-304/304.135/build/nv.c:3034:28: error: assignment from incompatible pointer type [-Werror=incompatible-pointer-types]
     nvl->rc_timer.function = nv_kern_rc_timer;
                            ^
/var/lib/dkms/nvidia-304/304.135/build/nv.c:3035:18: error: ‘struct timer_list’ has no member named ‘data’
     nvl->rc_timer.data = (unsigned long) nv;
                  ^
cc1: some warnings being treated as errors
scripts/Makefile.build:330: die Regel für Ziel „/var/lib/dkms/nvidia-304/304.135/build/nv.o“ scheiterte
make[3]: *** [/var/lib/dkms/nvidia-304/304.135/build/nv.o] Fehler 1
Makefile:1571: die Regel für Ziel „_module_/var/lib/dkms/nvidia-304/304.135/build“ scheiterte
make[2]: *** [_module_/var/lib/dkms/nvidia-304/304.135/build] Fehler 2
NVIDIA: left KBUILD.
nvidia.ko failed to build!
Makefile:258: die Regel für Ziel „module“ scheiterte
make[1]: *** [module] Fehler 1
makefile:59: die Regel für Ziel „module“ scheiterte
make: *** [module] Fehler 2

Wer weiß was dazu?

Gruß svgt
« Letzte Änderung: 12.09.2019, 20:17:00 von svgt »

Re: NVIDIA 6600GT Treiber wird nicht geladen
« Antwort #1 am: 11.09.2019, 01:16:12 »
Alles von Nvidia löschen: 
sudo apt-get purge nvidia*
sudo apt-get update 
 

Gehe auf den 4.4er Kernel zurück. 

Installiere den NV 304 über die Treiberverwaltung, das dauert. 
Neustart.
inxi -G

Re: NVIDIA 6600GT Treiber wird nicht geladen
« Antwort #2 am: 11.09.2019, 12:16:32 »
Schritt eins und zwei habe ich gemacht.

Wie gehe ich auf den 4.4er Kernel zurück?

Sollten nicht alle über Update angebotenen Kernels in Mint 18.3 mit diesem Nvidia-304 Treiber funktionieren?

Re: NVIDIA 6600GT Treiber wird nicht geladen
« Antwort #3 am: 11.09.2019, 12:24:55 »
Wie gehe ich auf den 4.4er Kernel zurück?
Per Akt.verwaltung installieren, rebooten und im Grub diesen Kernel auswählen. Wenn es funktioniert, dann den neuen 4.15 entfernen.

Re: NVIDIA 6600GT Treiber wird nicht geladen
« Antwort #4 am: 11.09.2019, 12:52:51 »
Ich finde nur in der Paketverwaltung Kernelversionen:

zB linux-image-4.4.0-98-generic als letzten einer  langen 4.4.0 Versionsliste.
dazu die passenden linux-headers.

sollte ich die beiden installieren?

Re: NVIDIA 6600GT Treiber wird nicht geladen
« Antwort #5 am: 11.09.2019, 14:11:00 »
Hi :)
nicht über die paketverwaltung (synaptic)
sondern über die aktualisierungsverwaltung...

Re: NVIDIA 6600GT Treiber wird nicht geladen
« Antwort #6 am: 11.09.2019, 14:32:44 »
Nun habe ich das über Synaptic installiert. Lässt sich auch normal starten.
Aber es funktioniert weder WLAN noch LAN danach.
Warum das diese Folge hat, verstehe ich nicht.
Also wieder deinstallieren.

Wie installiere ich denn diesen Kernel über die Aktualisierungsverwaltung ?

Re: NVIDIA 6600GT Treiber wird nicht geladen
« Antwort #7 am: 11.09.2019, 14:39:27 »
Wenn du es richtig gemacht hast, geht es auch über Synaptic, ist aber einfacher über die AV zu machen. Rebootet hattest du aber und auch mit inxi gecheckt, dass der 4.4er auch wirklich aktiv ist?
Zitat
Warum das diese Folge hat, verstehe ich nicht.
Weil im Kernel auch die Treiber stecken. Alte Kernel = Alte Treiber(versionen).

Re: NVIDIA 6600GT Treiber wird nicht geladen
« Antwort #8 am: 11.09.2019, 15:09:52 »
Also wieder deinstalliert. Dann den Kernel über die Aktualisierungsverwaltung neu installiert.
Das ganze mit dem Kernel 4.13 gemacht.

Nun geht wieder WLAN und LAN. Also hatte ich mit Synaptic was falsch gemacht.

Dann mit Treiberverwaltung den Nvidia-304 Treiber installiert.
Nach dem Neustart ist der Treiber aktiv und es sieht so aus:

hans@hans-D2461-C1 ~ $ inxi -zF
System:    Host: hans-D2461-C1 Kernel: 4.13.0-45-generic i686 (32 bit) Desktop: MATE 1.18.0
           Distro: Linux Mint 18.3 Sylvia
Machine:   Mobo: Intel model: D865GLC v: AAC28903-402
           Bios: Intel v: BF86510A.86A.0077.P25.0508040031 date: 08/04/2005
CPU:       Single core Intel Pentium 4 (-UP-) cache: 512 KB speed: 2393 MHz (max)
Graphics:  Card: NVIDIA NV43 [GeForce 6600 GT]
           Display Server: X.Org 1.18.4 drivers: nvidia (unloaded: fbdev,vesa,nouveau)
           Resolution: 1024x768@75.03hz
           GLX Renderer: GeForce 6600 GT/AGP/SSE2 GLX Version: 2.1.2 NVIDIA 304.135
Audio:     Card Intel 82801EB/ER (ICH5/ICH5R) AC'97 Audio Controller driver: snd_intel8x0
           Sound: Advanced Linux Sound Architecture v: k4.13.0-45-generic
Network:   Card: 3Com 3c905C-TX/TX-M [Tornado] driver: 3c59x
           IF: enp2s1 state: unknown speed: 100 Mbps duplex: full mac: <filter>
Drives:    HDD Total Size: 80.0GB (15.0% used) ID-1: /dev/sda model: ST380011A size: 80.0GB
Partition: ID-1: / size: 30G used: 7.2G (26%) fs: ext4 dev: /dev/sda1
           ID-2: /home size: 40G used: 185M (1%) fs: ext4 dev: /dev/sda3
           ID-3: swap-1 size: 4.29GB used: 0.00GB (0%) fs: swap dev: /dev/sda2
RAID:      No RAID devices: /proc/mdstat, md_mod kernel module present
Sensors:   None detected - is lm-sensors installed and configured?
Info:      Processes: 131 Uptime: 4 min Memory: 310.2/2011.6MB Client: Shell (bash) inxi: 2.2.35
hans@hans-D2461-C1 ~ $ hostname D865GLC
hostname: you must be root to change the host name
hans@hans-D2461-C1 ~ $ sudo hostname D865GLC
[sudo] Passwort für hans:
hans@hans-D2461-C1 ~ $

Nebenbei: wie kann ich den Hostnamen dauerhaft ändern? Nach dem Neustart ist diese Änderung wieder weg,
« Letzte Änderung: 11.09.2019, 15:15:20 von svgt »

Re: NVIDIA 6600GT Treiber wird nicht geladen
« Antwort #9 am: 11.09.2019, 15:40:47 »
Sieht gut aus. Das mit dem Hostnamen ist ein anderes Thema.
SuFu hilft.....

Re: NVIDIA 6600GT Treiber wird nicht geladen
« Antwort #10 am: 12.09.2019, 14:27:22 »
Hi :)
yep, nvidia 304 und 340(5er) laufen nicht mit neueren kerneln..

dann setze mal auf gelöst.. siehe hilfe hier oben auf der page.. danke :)

Re: NVIDIA 6600GT Treiber wird nicht geladen
« Antwort #11 am: 12.09.2019, 19:49:58 »
Hi,
hans@hans-D2461-C1 ~ $ inxi -zF
interessant das man auch mit dem Befehl inxi -zF" eine Rückmeldung erhält.

Re: NVIDIA 6600GT Treiber wird nicht geladen
« Antwort #12 am: 12.09.2019, 19:58:09 »
Ist normal. Auszug aus man inxi 

Zitat
USING OPTIONS
       Options  can  be combined if they do not conflict. You can either group
       the letters together or separate them.

       Letters with numbers can have no gap  or  a  gap  at  your  discretion,
       except when using  -t.

       For example: inxi -AG or inxi -A -G or inxi -c10

       Note  that all the short form options have long form equivalents, which
       are listed below. However, usually the short form is used  in  examples
       in order to keep things simple.


Re: NVIDIA 6600GT Treiber wird nicht geladen
« Antwort #13 am: 13.09.2019, 15:42:44 »
Nachdem es nun stabil läuft mit dem 4.13 Kernel, möchte ich alle anderen Kernel löschen.
Also auch den neueren 4.15.
Und alle vor 4.13.
Da in jeder MInt Version das Löschen der kernel anders geht,
wie geht es hier unter Mate 18.3 32bit ?

Re: NVIDIA 6600GT Treiber wird nicht geladen
« Antwort #14 am: 13.09.2019, 16:00:40 »
Hi :)
genau wie in allen mints seit 17?

aktualisierungsverwaltung..